Target
C-C chemokine receptor type 5
Ligand
BDBM313992
Substrate
Meas. Tech.
Calcium Flux Inhibition Experiment
IC50
4.63±n/a nM
Citation
 Liu, HWu, BZheng, YXie, XJiang, HPeng, PLuo, RLi, JLi, JZhu, YChen, YZhang, HYang, LZhou, YChen, K 1-(3-aminopropyl) substituted cyclic amine compounds, preparation method therefor, and pharmaceutical compositions and uses thereof US Patent  US10167299 Publication Date 1/1/2019 
Target
Name:
C-C chemokine receptor type 5
Synonyms:
C-C CKR-5 CC-CKR-5 CCR5 CCR5_HUMAN CHEMR13 HIV-1 fusion coreceptor
Type:
Enzyme
Mol. Mass.:
40540.21
Organism:
Homo sapiens (Human)
Description:
P51681
Residue:
352
  
Inhibitor
Name:
BDBM313992
Synonyms:
US10167299, Example 64
Type:
Small organic molecule
Emp. Form.:
C29H43F2N5OS
Mol. Mass.:
547.746
SMILES:
CCc1ccc(s1)[C@H](CCN1C2CCC1CC(C2)n1c(C)nnc1C(C)C)NC(=O)C1CCC(F)(F)CC1
: