Target
MAP kinase-interacting serine/threonine-protein kinase 1
Ligand
BDBM168231
Substrate
Meas. Tech.
Mnk Biochemical Enzymatic Assay
Temperature
298.15±n/a K
IC50
>100±n/a nM
Comments
extracted
Citation
 Reich, SHSprengeler, PAWebber, SEXiang, AXErnst, JT MNK inhibitors and methods related thereto US Patent  US9669031 Publication Date 6/6/2017 
Target
Name:
MAP kinase-interacting serine/threonine-protein kinase 1
Synonyms:
MAP Kinase-Interacting Protein Kinase (MNK1) MAP kinase-interacting serine/threonine-protein kinase 1 (MnK1) MAP-kinase interacting kinase 1 (MNK1) MKNK1 MNK1
Type:
Serine/threonine-protein kinase
Mol. Mass.:
51342.85
Organism:
Homo sapiens (Human)
Description:
Q9BUB5
Residue:
465
  
Inhibitor
Name:
BDBM168231
Synonyms:
US9669031, 59 6-((6-((1-cyclopropyl-2,2,2-trifluoroethyl)amino)pyrimidin-4-yl)amino)-3-methyl-3-(trifluoromethyl)-2,3-dihydroimidazo[1,5-a]pyridine-1,5-dione (Cpd. No. 59)
Type:
Small organic molecule
Emp. Form.:
C18H16F6N6O2
Mol. Mass.:
462.3491
SMILES:
CC1(NC(=O)c2ccc(Nc3cc(NC(C4CC4)C(F)(F)F)ncn3)c(=O)n12)C(F)(F)F
: