Target
Plasma kallikrein
Ligand
BDBM283364
Substrate
Meas. Tech.
In Vitro Enzyme Inhibition Assay
IC50
<100±n/a nM
Citation
 McDonald, AQian, S Therapeutic inhibitory compounds US Patent  US9611252 Publication Date 4/4/2017 
Target
Name:
Plasma kallikrein
Synonyms:
Fletcher factor KLKB1 Kallikrein Plasma kallikrein heavy chain Plasma prekallikrein
Type:
Protein
Mol. Mass.:
71391.16
Organism:
Homo sapiens (Human)
Description:
P03952
Residue:
638
  
Inhibitor
Name:
BDBM283364
Synonyms:
N-((1-aminoisoquinolin-6-yl)methyl)-2-((3- methyl-8-(methylsulfonyl)quinolin-6- yl)methyl)isonicotinamide US10266515, Example 16 US11021463, Example 16 | US9611252, Example 16
Type:
Small organic molecule
Emp. Form.:
C28H25N5O3S
Mol. Mass.:
511.595
SMILES:
Cc1cnc2c(cc(Cc3cc(ccn3)C(=O)NCc3ccc4c(N)nccc4c3)cc2c1)S(C)(=O)=O
: