Target
Plasma kallikrein
Ligand
BDBM283366
Substrate
Meas. Tech.
In Vitro Enzyme Inhibition Assay
IC50
<100±n/a nM
Citation
 McDonald, AQian, S Therapeutic inhibitory compounds US Patent  US9611252 Publication Date 4/4/2017 
Target
Name:
Plasma kallikrein
Synonyms:
Fletcher factor KLKB1 Kallikrein Plasma kallikrein heavy chain Plasma prekallikrein
Type:
Protein
Mol. Mass.:
71391.16
Organism:
Homo sapiens (Human)
Description:
P03952
Residue:
638
  
Inhibitor
Name:
BDBM283366
Synonyms:
N-((6-fluoro-1H-indol-5-yl)methyl)-2-((3- methyl-8-(methylsulfonyl)quinolin-6- yl)methyl)isonicotinamide US10266515, Example 18 US11021463, Example 18 | US9611252, Example 18
Type:
Small organic molecule
Emp. Form.:
C27H23FN4O3S
Mol. Mass.:
502.56
SMILES:
Cc1cnc2c(cc(Cc3cc(ccn3)C(=O)NCc3cc4cc[nH]c4cc3F)cc2c1)S(C)(=O)=O
: