Target
Plasma kallikrein
Ligand
BDBM283369
Substrate
Meas. Tech.
In Vitro Enzyme Inhibition Assay
IC50
<100±n/a nM
Citation
 McDonald, AQian, S Therapeutic inhibitory compounds US Patent  US9611252 Publication Date 4/4/2017 
Target
Name:
Plasma kallikrein
Synonyms:
Fletcher factor KLKB1 Kallikrein Plasma kallikrein heavy chain Plasma prekallikrein
Type:
Protein
Mol. Mass.:
71391.16
Organism:
Homo sapiens (Human)
Description:
P03952
Residue:
638
  
Inhibitor
Name:
BDBM283369
Synonyms:
N-((3-chloro-4-fluoro-1H-indol-5-yl)methyl)-2- ((3-methyl-8-(methylsulfonyl)quinolin-6- yl)methyl)isonicotinamide US10266515, Example 21 US11021463, Example 21 | US9611252, Example 21
Type:
Small organic molecule
Emp. Form.:
C27H22ClFN4O3S
Mol. Mass.:
537.005
SMILES:
Cc1cnc2c(cc(Cc3cc(ccn3)C(=O)NCc3ccc4[nH]cc(Cl)c4c3F)cc2c1)S(C)(=O)=O
: