Target
Plasma kallikrein
Ligand
BDBM283377
Substrate
Meas. Tech.
In Vitro Enzyme Inhibition Assay
IC50
<100±n/a nM
Citation
 McDonald, AQian, S Therapeutic inhibitory compounds US Patent  US9611252 Publication Date 4/4/2017 
Target
Name:
Plasma kallikrein
Synonyms:
Fletcher factor KLKB1 Kallikrein Plasma kallikrein heavy chain Plasma prekallikrein
Type:
Protein
Mol. Mass.:
71391.16
Organism:
Homo sapiens (Human)
Description:
P03952
Residue:
638
  
Inhibitor
Name:
BDBM283377
Synonyms:
N-((6-amino-4-methylpyridin-3-yl)methyl)-2- ((3-chloroquinolin-6-yl)methyl)isonicotinamide US10266515, Example 29 US11021463, Example 29 | US9611252, Example 29
Type:
Small organic molecule
Emp. Form.:
C23H20ClN5O
Mol. Mass.:
417.891
SMILES:
Cc1cc(N)ncc1CNC(=O)c1ccnc(Cc2ccc3ncc(Cl)cc3c2)c1
: