Target
Plasma kallikrein
Ligand
BDBM283385
Substrate
Meas. Tech.
In Vitro Enzyme Inhibition Assay
IC50
<100±n/a nM
Citation
 McDonald, AQian, S Therapeutic inhibitory compounds US Patent  US9611252 Publication Date 4/4/2017 
Target
Name:
Plasma kallikrein
Synonyms:
Fletcher factor KLKB1 Kallikrein Plasma kallikrein heavy chain Plasma prekallikrein
Type:
Protein
Mol. Mass.:
71391.16
Organism:
Homo sapiens (Human)
Description:
P03952
Residue:
638
  
Inhibitor
Name:
BDBM283385
Synonyms:
N-((5-chloro-1H-indazol-3-yl)methyl)-2-((3- chloroquinolin-6-yl)methyl)isonictotinamide US10266515, Example 37 US11021463, Example 37 | US9611252, Example 37
Type:
Small organic molecule
Emp. Form.:
C24H17Cl2N5O
Mol. Mass.:
462.331
SMILES:
Clc1ccc2[nH]nc(CNC(=O)c3ccnc(Cc4ccc5ncc(Cl)cc5c4)c3)c2c1
: