Target
Plasma kallikrein
Ligand
BDBM283388
Substrate
Meas. Tech.
In Vitro Enzyme Inhibition Assay
IC50
<100±n/a nM
Citation
 McDonald, AQian, S Therapeutic inhibitory compounds US Patent  US9611252 Publication Date 4/4/2017 
Target
Name:
Plasma kallikrein
Synonyms:
Fletcher factor KLKB1 Kallikrein Plasma kallikrein heavy chain Plasma prekallikrein
Type:
Protein
Mol. Mass.:
71391.16
Organism:
Homo sapiens (Human)
Description:
P03952
Residue:
638
  
Inhibitor
Name:
BDBM283388
Synonyms:
N-((3-chloro-4-fluoro-1H-indol-5-yl)methyl)-2- ((3-chloroquinolin-6-yl)methyl)isonicotinamide US10266515, Example 40 US11021463, Example 40 | US9611252, Example 40
Type:
Small organic molecule
Emp. Form.:
C25H17Cl2FN4O
Mol. Mass.:
479.333
SMILES:
Fc1c(CNC(=O)c2ccnc(Cc3ccc4ncc(Cl)cc4c3)c2)ccc2[nH]cc(Cl)c12
: