Target
Plasma kallikrein
Ligand
BDBM283399
Substrate
Meas. Tech.
In Vitro Enzyme Inhibition Assay
IC50
<100±n/a nM
Citation
 McDonald, AQian, S Therapeutic inhibitory compounds US Patent  US9611252 Publication Date 4/4/2017 
Target
Name:
Plasma kallikrein
Synonyms:
Fletcher factor KLKB1 Kallikrein Plasma kallikrein heavy chain Plasma prekallikrein
Type:
Protein
Mol. Mass.:
71391.16
Organism:
Homo sapiens (Human)
Description:
P03952
Residue:
638
  
Inhibitor
Name:
BDBM283399
Synonyms:
N-((3-chloro-4-fluoro-1H-indol-5-yl)methyl)-2- ((3-chloro-8-cyanoquinolin-6- yl)methyl)isonicotinamide US10266515, Example 51 US11021463, Example 51 | US9611252, Example 51
Type:
Small organic molecule
Emp. Form.:
C26H16Cl2FN5O
Mol. Mass.:
504.343
SMILES:
Fc1c(CNC(=O)c2ccnc(Cc3cc(C#N)c4ncc(Cl)cc4c3)c2)ccc2[nH]cc(Cl)c12
: