Target
Plasma kallikrein
Ligand
BDBM283400
Substrate
Meas. Tech.
In Vitro Enzyme Inhibition Assay
IC50
<100±n/a nM
Citation
 McDonald, AQian, S Therapeutic inhibitory compounds US Patent  US9611252 Publication Date 4/4/2017 
Target
Name:
Plasma kallikrein
Synonyms:
Fletcher factor KLKB1 Kallikrein Plasma kallikrein heavy chain Plasma prekallikrein
Type:
Protein
Mol. Mass.:
71391.16
Organism:
Homo sapiens (Human)
Description:
P03952
Residue:
638
  
Inhibitor
Name:
BDBM283400
Synonyms:
2-((3-chloro-8-cyanoquinolin-6-yl)methyl)-N- ((6-fluoro-1H-indol-5-yl)methyl)isonicotinamide US10266515, Example 52 US11021463, Example 52 | US9611252, Example 52
Type:
Small organic molecule
Emp. Form.:
C26H17ClFN5O
Mol. Mass.:
469.897
SMILES:
Fc1cc2[nH]ccc2cc1CNC(=O)c1ccnc(Cc2cc(C#N)c3ncc(Cl)cc3c2)c1
: