Target
Plasma kallikrein
Ligand
BDBM283405
Substrate
Meas. Tech.
In Vitro Enzyme Inhibition Assay
IC50
<100±n/a nM
Citation
 McDonald, AQian, S Therapeutic inhibitory compounds US Patent  US9611252 Publication Date 4/4/2017 
Target
Name:
Plasma kallikrein
Synonyms:
Fletcher factor KLKB1 Kallikrein Plasma kallikrein heavy chain Plasma prekallikrein
Type:
Protein
Mol. Mass.:
71391.16
Organism:
Homo sapiens (Human)
Description:
P03952
Residue:
638
  
Inhibitor
Name:
BDBM283405
Synonyms:
N-((1-aminoisoquinolin-6-yl)methyl)-2-((3- chloro-8-cyanoquinolin-6- yl)methyl)isonicotinamide US10266515, Example 57 US11021463, Example 57 | US9611252, Example 57
Type:
Small organic molecule
Emp. Form.:
C27H19ClN6O
Mol. Mass.:
478.932
SMILES:
Nc1nccc2cc(CNC(=O)c3ccnc(Cc4cc(C#N)c5ncc(Cl)cc5c4)c3)ccc12
: