Target
Plasma kallikrein
Ligand
BDBM283406
Substrate
Meas. Tech.
In Vitro Enzyme Inhibition Assay
IC50
<100±n/a nM
Citation
 McDonald, AQian, S Therapeutic inhibitory compounds US Patent  US9611252 Publication Date 4/4/2017 
Target
Name:
Plasma kallikrein
Synonyms:
Fletcher factor KLKB1 Kallikrein Plasma kallikrein heavy chain Plasma prekallikrein
Type:
Protein
Mol. Mass.:
71391.16
Organism:
Homo sapiens (Human)
Description:
P03952
Residue:
638
  
Inhibitor
Name:
BDBM283406
Synonyms:
6-((4-(((6-amino-2,4-dimethylpyridin-3- yl)methyl)carbamoyl)pyridin-2-yl)methyl)-3- chloroquinoline-8-carboxamide US10266515, Example 58 US11021463, Example 58 | US9611252, Example 58
Type:
Small organic molecule
Emp. Form.:
C25H23ClN6O2
Mol. Mass.:
474.942
SMILES:
Cc1cc(N)nc(C)c1CNC(=O)c1ccnc(Cc2cc(C(N)=O)c3ncc(Cl)cc3c2)c1
: