Target
Plasma kallikrein
Ligand
BDBM283407
Substrate
Meas. Tech.
In Vitro Enzyme Inhibition Assay
IC50
<100±n/a nM
Citation
 McDonald, AQian, S Therapeutic inhibitory compounds US Patent  US9611252 Publication Date 4/4/2017 
Target
Name:
Plasma kallikrein
Synonyms:
Fletcher factor KLKB1 Kallikrein Plasma kallikrein heavy chain Plasma prekallikrein
Type:
Protein
Mol. Mass.:
71391.16
Organism:
Homo sapiens (Human)
Description:
P03952
Residue:
638
  
Inhibitor
Name:
BDBM283407
Synonyms:
3-chloro-6-((4-(((3-chloro-6-fluoro-1H-indol-5- yl)methyl)carbamoyl)pyridin-2- yl)methyl)quinoline-8-carboxamide US10266515, Example 59 US9611252, Example 59
Type:
Small organic molecule
Emp. Form.:
C26H18Cl2FN5O2
Mol. Mass.:
522.358
SMILES:
NC(=O)c1cc(Cc2cc(ccn2)C(=O)NCc2cc3c(Cl)c[nH]c3cc2F)cc2cc(Cl)cnc12
: