Target
Plasma kallikrein
Ligand
BDBM283415
Substrate
Meas. Tech.
In Vitro Enzyme Inhibition Assay
IC50
<100±n/a nM
Citation
 McDonald, AQian, S Therapeutic inhibitory compounds US Patent  US9611252 Publication Date 4/4/2017 
Target
Name:
Plasma kallikrein
Synonyms:
Fletcher factor KLKB1 Kallikrein Plasma kallikrein heavy chain Plasma prekallikrein
Type:
Protein
Mol. Mass.:
71391.16
Organism:
Homo sapiens (Human)
Description:
P03952
Residue:
638
  
Inhibitor
Name:
BDBM283415
Synonyms:
N-((6-amino-2,4-dimethylpyridin-3-yl)methyl)- 2-((3-chloro-8-(methylsulfonyl)quinolin-6- yl)methyl)isonicotinamide US10266515, Example 67 US11021463, Example 67 | US9611252, Example 67
Type:
Small organic molecule
Emp. Form.:
C25H24ClN5O3S
Mol. Mass.:
510.008
SMILES:
Cc1cc(N)nc(C)c1CNC(=O)c1ccnc(Cc2cc(c3ncc(Cl)cc3c2)S(C)(=O)=O)c1
: