Target
Plasma kallikrein
Ligand
BDBM283420
Substrate
Meas. Tech.
In Vitro Enzyme Inhibition Assay
IC50
<100±n/a nM
Citation
 McDonald, AQian, S Therapeutic inhibitory compounds US Patent  US9611252 Publication Date 4/4/2017 
Target
Name:
Plasma kallikrein
Synonyms:
Fletcher factor KLKB1 Kallikrein Plasma kallikrein heavy chain Plasma prekallikrein
Type:
Protein
Mol. Mass.:
71391.16
Organism:
Homo sapiens (Human)
Description:
P03952
Residue:
638
  
Inhibitor
Name:
BDBM283420
Synonyms:
N-((3-chloro-6-fluoro-1H-indol-5-yl)methyl)-2- ((8-cyano-3-methylquinolin-6- yl)methyl)isonicotinamide US10308637, Example 72 US9611252, Example 72
Type:
Small organic molecule
Emp. Form.:
C27H19ClFN5O
Mol. Mass.:
483.924
SMILES:
Cc1cnc2c(cc(Cc3cc(ccn3)C(=O)NCc3cc4c(Cl)c[nH]c4cc3F)cc2c1)C#N
: