Target
Plasma kallikrein
Ligand
BDBM283423
Substrate
Meas. Tech.
In Vitro Enzyme Inhibition Assay
IC50
<100±n/a nM
Citation
 McDonald, AQian, S Therapeutic inhibitory compounds US Patent  US9611252 Publication Date 4/4/2017 
Target
Name:
Plasma kallikrein
Synonyms:
Fletcher factor KLKB1 Kallikrein Plasma kallikrein heavy chain Plasma prekallikrein
Type:
Protein
Mol. Mass.:
71391.16
Organism:
Homo sapiens (Human)
Description:
P03952
Residue:
638
  
Inhibitor
Name:
BDBM283423
Synonyms:
N-((5-chloro-1H-indazol-3-yl)methyl)-2-((8- cyano-3-methylquinolin-6- yl)methyl)isonicotinamide US10266515, Example 75 US11021463, Example 75 | US9611252, Example 75
Type:
Small organic molecule
Emp. Form.:
C26H19ClN6O
Mol. Mass.:
466.922
SMILES:
Cc1cnc2c(cc(Cc3cc(ccn3)C(=O)NCc3n[nH]c4ccc(Cl)cc34)cc2c1)C#N
: