Target
Plasma kallikrein
Ligand
BDBM283425
Substrate
Meas. Tech.
In Vitro Enzyme Inhibition Assay
IC50
<100±n/a nM
Citation
 McDonald, AQian, S Therapeutic inhibitory compounds US Patent  US9611252 Publication Date 4/4/2017 
Target
Name:
Plasma kallikrein
Synonyms:
Fletcher factor KLKB1 Kallikrein Plasma kallikrein heavy chain Plasma prekallikrein
Type:
Protein
Mol. Mass.:
71391.16
Organism:
Homo sapiens (Human)
Description:
P03952
Residue:
638
  
Inhibitor
Name:
BDBM283425
Synonyms:
6-((4-(((6-amino-2,4-dimethylpyridin-3- yl)methyl)carbamoyl)pyridin-2-yl)methyl)-3- methylquinoline-8-carboxamide US10266515, Example 77 US11021463, Example 77 | US9611252, Example 77
Type:
Small organic molecule
Emp. Form.:
C26H26N6O2
Mol. Mass.:
454.5236
SMILES:
Cc1cnc2c(cc(Cc3cc(ccn3)C(=O)NCc3c(C)cc(N)nc3C)cc2c1)C(N)=O
: