Target
Plasma kallikrein
Ligand
BDBM283428
Substrate
Meas. Tech.
In Vitro Enzyme Inhibition Assay
IC50
<100±n/a nM
Citation
 McDonald, AQian, S Therapeutic inhibitory compounds US Patent  US9611252 Publication Date 4/4/2017 
Target
Name:
Plasma kallikrein
Synonyms:
Fletcher factor KLKB1 Kallikrein Plasma kallikrein heavy chain Plasma prekallikrein
Type:
Protein
Mol. Mass.:
71391.16
Organism:
Homo sapiens (Human)
Description:
P03952
Residue:
638
  
Inhibitor
Name:
BDBM283428
Synonyms:
6-((4-(((3-chloro-1H-pyrrolo[2,3-b]pyridin-5- yl)methyl)carbamoyl)pyridin-2-yl)methyl)-3- methylquinoline-8-carboxamide US10266515, Example 80 US11021463, Example 80 | US9611252, Example 80
Type:
Small organic molecule
Emp. Form.:
C26H21ClN6O2
Mol. Mass.:
484.937
SMILES:
Cc1cnc2c(cc(Cc3cc(ccn3)C(=O)NCc3cnc4[nH]cc(Cl)c4c3)cc2c1)C(N)=O
: