Target
Cathepsin D
Ligand
BDBM171563
Substrate
Meas. Tech.
In Vitro Enzymatic FRET Assay
IC50
260500±n/a nM
Citation
 Minatti, AELow, JDAllen, JRAmegadzie, ABrown, JFrohn, MJGuzman-Perez, AHarrington, PELopez, PMa, VVNishimura, NQian, WRumfelt, SRzasa, RMSham, KSmith, ALWhite, RXue, Q Perfluorinated cyclopropyl fused 1,3-oxazin-2-amine compounds as beta-secretase inhibitors and methods of use US Patent  US9611261 Publication Date 4/4/2017 
Target
Name:
Cathepsin D
Synonyms:
CATD_HUMAN CTSD Cathepsin D heavy chain Cathepsin D precursor
Type:
Enzyme
Mol. Mass.:
44551.72
Organism:
Homo sapiens (Human)
Description:
Human proCathepsin D (SwissProt accession number P07339) was expressed in Sf9 cells, purified, and autoactivated.
Residue:
412
  
Inhibitor
Name:
BDBM171563
Synonyms:
US9085576, 197 | US9611261, Example 197
Type:
Small organic molecule
Emp. Form.:
C20H17F2N5O3
Mol. Mass.:
413.3775
SMILES:
NC1=N[C@@](CF)([C@H]2C[C@H]2O1)c1cc(NC(=O)c2cnc(OCC#C)cn2)ccc1F
: