Target
Beta-secretase 1
Ligand
BDBM171651
Substrate
Meas. Tech.
In Vitro Enzymatic FRET Assay
IC50
2.20±n/a nM
Citation
 Minatti, AELow, JDAllen, JRAmegadzie, ABrown, JFrohn, MJGuzman-Perez, AHarrington, PELopez, PMa, VVNishimura, NQian, WRumfelt, SRzasa, RMSham, KSmith, ALWhite, RXue, Q Perfluorinated cyclopropyl fused 1,3-oxazin-2-amine compounds as beta-secretase inhibitors and methods of use US Patent  US9611261 Publication Date 4/4/2017 
Target
Name:
Beta-secretase 1
Synonyms:
ASP2 Aspartyl protease 2 BACE1 Beta-secretase (BACE) Beta-secretase 1 (BACE 1) Beta-secretase 1 (BACE1) Beta-site amyloid precursor protein cleaving enzyme 1 Memapsin-2 beta-Secretase (BACE-1) | beta-Secretase (BACE1)
Type:
Protein
Mol. Mass.:
55755.10
Organism:
Homo sapiens (Human)
Description:
P56817
Residue:
501
  
Inhibitor
Name:
BDBM171651
Synonyms:
US9085576, 285 | US9611261, Example 285
Type:
Small organic molecule
Emp. Form.:
C21H19ClFN5O3
Mol. Mass.:
443.859
SMILES:
CC#CCOc1cnc(cn1)C(=O)Nc1ccc(Cl)c(c1)[C@@]1(CF)N=C(N)O[C@@H]2C[C@H]12
: