Target
Cyclin-T1/Cyclin-dependent kinase 9
Ligand
BDBM168432
Substrate
Meas. Tech.
CDK9/CycT1 Kinase Assay
pH
8±n/a
Temperature
295.15±n/a K
IC50
5.00±n/a nM
Comments
extracted
Citation
 Lücking, UBohlmann, RScholz, ASiemeister, GGnoth, MJBömer, UKosemund, DLienau, PRühter, GSchultz-Fademrecht, C 4-aryl-N-phenyl-1,3,5-triazin-2-amines containing a sulfoximine group US Patent  US9669034 Publication Date 6/6/2017 
Target
Name:
Cyclin-T1/Cyclin-dependent kinase 9
Synonyms:
CDK9/ Cyclin-T1 CDK9/Cyclin T Cyclin T1/dependent kinase 9 | Cyclin-Dependent Kinase 9 (CDK9)
Type:
Protein Complex
Mol. Mass.:
Description:
Components:
This complex has 2 components.
Component 1
Name:
Cyclin-T1
Synonyms:
CCNT1 CycT Cyclin T Cyclin-T
Type:
Enzyme Subunit
Mol. Mass.:
80712.40
Organism:
Homo sapiens (Human)
Description:
Residue:
726
  
Component 2
Name:
Cyclin-dependent kinase 9
Synonyms:
C-2K CDK9 Cell division cycle 2-like protein kinase 4 Cyclin-Dependent Kinase 9 (CDK9) Serine/threonine-protein kinase PITALRE Tat-associated kinase complex catalytic subunit
Type:
Enzyme Subunit
Mol. Mass.:
42789.13
Organism:
Homo sapiens (Human)
Description:
Residue:
372
  
Inhibitor
Name:
BDBM168432
Synonyms:
US9669034, 42 (rac)-Ethyl[{3-[(4-{2-[(4-fluorobenzyl)oxy]phenyl}-1,3,5-triazin-2-yl)amino]benzyl}(methyl)oxido-λ6-sulfanylidene]carbamate
Type:
Small organic molecule
Emp. Form.:
C27H26FN5O4S
Mol. Mass.:
535.59
SMILES:
CCOC(=O)N=S(C)(=O)Cc1cccc(Nc2ncnc(n2)-c2ccccc2OCc2ccc(F)cc2)c1
: