Target
Cyclin-T1/Cyclin-dependent kinase 9
Ligand
BDBM179848
Substrate
Meas. Tech.
CDK9/CycT1 Kinase Assay
pH
8±n/a
Temperature
295.15±n/a K
IC50
2.00±n/a nM
Comments
extracted
Citation
 Lücking, UBohlmann, RScholz, ASiemeister, GGnoth, MJBömer, UKosemund, DLienau, PRühter, GSchultz-Fademrecht, C 4-aryl-N-phenyl-1,3,5-triazin-2-amines containing a sulfoximine group US Patent  US9669034 Publication Date 6/6/2017 
Target
Name:
Cyclin-T1/Cyclin-dependent kinase 9
Synonyms:
CDK9/ Cyclin-T1 CDK9/Cyclin T Cyclin T1/dependent kinase 9 | Cyclin-Dependent Kinase 9 (CDK9)
Type:
Protein Complex
Mol. Mass.:
Description:
Components:
This complex has 2 components.
Component 1
Name:
Cyclin-T1
Synonyms:
CCNT1 CycT Cyclin T Cyclin-T
Type:
Enzyme Subunit
Mol. Mass.:
80712.40
Organism:
Homo sapiens (Human)
Description:
Residue:
726
  
Component 2
Name:
Cyclin-dependent kinase 9
Synonyms:
C-2K CDK9 Cell division cycle 2-like protein kinase 4 Cyclin-Dependent Kinase 9 (CDK9) Serine/threonine-protein kinase PITALRE Tat-associated kinase complex catalytic subunit
Type:
Enzyme Subunit
Mol. Mass.:
42789.13
Organism:
Homo sapiens (Human)
Description:
Residue:
372
  
Inhibitor
Name:
BDBM179848
Synonyms:
US9669034, 113 (rac)-[Cyclopropyl(3-{[4-(4-fluoro-2-methoxyphenyl)-1,3,5-triazin-2-yl]amino}benzyl)oxido-λ6-sulfanylidene]cyanamide
Type:
Small organic molecule
Emp. Form.:
C21H19FN6O2S
Mol. Mass.:
438.478
SMILES:
COc1cc(F)ccc1-c1ncnc(Nc2cccc(CS(=O)(=NC#N)C3CC3)c2)n1
: