Target
Orexin/Hypocretin receptor type 1
Ligand
BDBM314629
Substrate
Meas. Tech.
Receptor Radioligand Binding Assay
Ki
2.00±n/a nM
Citation
 Shireman, BTLebold, TPDvorak, CACoate, HRZiff, JMPreville, CGelin, CChen, G Substituted 2-azabicycles and their use as orexin receptor modulators US Patent  US9611262 Publication Date 4/4/2017 
Target
Name:
Orexin/Hypocretin receptor type 1
Synonyms:
Hcrtr1 OX1R_RAT Orexin receptor type 1 (OX1R) Ox1-R | Ox1R
Type:
Protein
Mol. Mass.:
46817.55
Organism:
Rattus norvegicus (Rat)
Description:
P56718
Residue:
416
  
Inhibitor
Name:
BDBM314629
Synonyms:
US9611262, Example 163 | [(1R,2R,4S,5R)-2-deuterio-2-(trideuteriomethyl)-5-[[5-(trifluoromethyl)-2-pyridyl]oxy]-3-azabicyclo[2.2.1]heptan-3-yl]-[2-(triazol-2-yl)phenyl]methanone
Type:
Small organic molecule
Emp. Form.:
C22H23N5O2
Mol. Mass.:
389.4503
SMILES:
CC1C2CC(Oc3ccc(C)cn3)C(C2)N1C(=O)c1ccccc1-n1nccn1
: