Target
Caspase-1
Ligand
BDBM10552
Substrate
Caspase-1 Fluorogenic Substrate
Meas. Tech.
Caspase Inhibition Assay
IC50
5900±n/a nM
Citation
 Han, YGiroux, AGrimm, ELAspiotis, RFrancoeur, SBayly, CIMckay, DJRoy, SXanthoudakis, SVaillancourt, JPRasper, DMTam, JTawa, PThornberry, NAPaterson, EPGarcia-Calvo, MBecker, JWRotonda, JNicholson, DWZamboni, RJ Discovery of novel aspartyl ketone dipeptides as potent and selective caspase-3 inhibitors. Bioorg Med Chem Lett 14:805-8 (2004)  
Target
Name:
Caspase-1
Synonyms:
CASP1 Caspase ICE IL1BCE Interleukin-1 beta-converting enzyme
Type:
Enzyme
Mol. Mass.:
45154.13
Organism:
Homo sapiens (Human)
Description:
P29466
Residue:
404
  
Inhibitor
Name:
BDBM10552
Synonyms:
(3S)-5-(benzylsulfanyl)-3-[(2S)-2-[1-(5-acetyl-2-methoxyphenyl)acetamido]-3-methylbutanamido]-4-oxopentanoic acid valine aspartyl ketone analog 15
Type:
Small organic molecule
Emp. Form.:
C28H34N2O7S
Mol. Mass.:
542.644
SMILES:
COc1ccc(cc1CC(=O)N[C@@H](C(C)C)C(=O)N[C@@H](CC(O)=O)C(=O)CSCc1ccccc1)C(C)=O
:
Substrate
Name:
Caspase-1 Fluorogenic Substrate
Synonyms:
Ac-YVAD-AMC
Type:
Mol. Mass.:
1713.07
Organism:
Description:
AMC=7-Amino-4-methylcoumarin
Residue:
17
ACTYRVALALAASPAMC