Target
Caspase-8
Ligand
BDBM10552
Substrate
Caspase-8 Fluorogenic Substrate
Meas. Tech.
Caspase Inhibition Assay
IC50
2900±n/a nM
Citation
 Han, YGiroux, AGrimm, ELAspiotis, RFrancoeur, SBayly, CIMckay, DJRoy, SXanthoudakis, SVaillancourt, JPRasper, DMTam, JTawa, PThornberry, NAPaterson, EPGarcia-Calvo, MBecker, JWRotonda, JNicholson, DWZamboni, RJ Discovery of novel aspartyl ketone dipeptides as potent and selective caspase-3 inhibitors. Bioorg Med Chem Lett 14:805-8 (2004)  
Target
Name:
Caspase-8
Synonyms:
Apoptotic cysteine protease CAP4 CASP8 Caspase Caspase-8 subunit p18 FADD-like ICE ICE-like apoptotic protease 5 MCH5 | MORT1-associated CED-3 homolog
Type:
Enzyme
Mol. Mass.:
55373.89
Organism:
Homo sapiens (Human)
Description:
Q14790
Residue:
479
  
Inhibitor
Name:
BDBM10552
Synonyms:
(3S)-5-(benzylsulfanyl)-3-[(2S)-2-[1-(5-acetyl-2-methoxyphenyl)acetamido]-3-methylbutanamido]-4-oxopentanoic acid valine aspartyl ketone analog 15
Type:
Small organic molecule
Emp. Form.:
C28H34N2O7S
Mol. Mass.:
542.644
SMILES:
COc1ccc(cc1CC(=O)N[C@@H](C(C)C)C(=O)N[C@@H](CC(O)=O)C(=O)CSCc1ccccc1)C(C)=O
:
Substrate
Name:
Caspase-8 Fluorogenic Substrate
Synonyms:
Ac-IETD-AMC
Type:
Peptide
Mol. Mass.:
1673.49
Organism:
Description:
AMC=7-Amino-4-methylcoumarin
Residue:
16
ACILEGLTHRASPAMC