Target
Tyrosine-protein kinase JAK1
Ligand
BDBM314690
Substrate
Meas. Tech.
In Vitro Assay
IC50
<10±n/a nM
Citation
 Yao, WBurns, DZhuo, J Azetidinyl phenyl, pyridyl or pyrazinyl carboxamide derivatives as JAK inhibitors US Patent  US9611269 Publication Date 4/4/2017 
Target
Name:
Tyrosine-protein kinase JAK1
Synonyms:
JAK-1 JAK1A JAK1_HUMAN Janus kinase 1 (JAK1) | Janus kinase 1 JAK1
Type:
Protein
Mol. Mass.:
133293.73
Organism:
Homo sapiens (Human)
Description:
P23458
Residue:
1154
  
Inhibitor
Name:
BDBM314690
Synonyms:
US10513522, Example 27 US9611269, Example 3
Type:
Small organic molecule
Emp. Form.:
C24H23FN8O
Mol. Mass.:
458.4908
SMILES:
CC(C)NC(=O)c1ccc(N2CC(CC#N)(C2)n2cc(cn2)-c2ncnc3[nH]ccc23)c(F)c1
: