Target
Potassium voltage-gated channel subfamily H member 2
Ligand
BDBM315941
Substrate
Meas. Tech.
Kv11.1 (hERG) ION CHANNEL ACTIVITY (Patch Clamp Assay)
Ki
12500±n/a nM
Citation
 Fuchss, TEmde, UBuchstaller, HMederski, W Arylquinazolines US Patent  US10172859 Publication Date 1/8/2019 
Target
Name:
Potassium voltage-gated channel subfamily H member 2
Synonyms:
1,3-beta-glucan synthase component GLS2 ERG Eag-related protein 1 Ether-a-go-go-related gene (HERG) Ether-a-go-go-related gene potassium channel 1 Ether-a-go-go-related gene potassium channel 1 (hERG1) Ether-a-go-go-related protein 1 H-ERG KCNH2 Potassium voltage-gated channel subfamily H member 2 (hERG) Voltage-gated potassium channel subunit Kv11.1 hERG Potassium Channel 1 | putative potassium channel subunit
Type:
Multi-pass membrane protein
Mol. Mass.:
126672.65
Organism:
Homo sapiens (Human)
Description:
Q12809
Residue:
1159
  
Inhibitor
Name:
BDBM315941
Synonyms:
6-{[2-Fluoro-5-(7- morpholin-4-yl- quinazolin-4-yl)- phenyl]hydroxy- methyl}-1-methyl-1H- pyridin-2-one (Ena 2)see racemate US10172859, Example 366 US11065253, Example 401 | US9732094, Example 401
Type:
Small organic molecule
Emp. Form.:
C25H23FN4O3
Mol. Mass.:
446.4735
SMILES:
Cn1c(cccc1=O)C(O)c1cc(ccc1F)-c1ncnc2cc(ccc12)N1CCOCC1
: