Target
Lysine-specific histone demethylase 1A
Ligand
BDBM254572
Substrate
Meas. Tech.
LSD1 Assays
pH
7.4±n/a
Temperature
298.15±n/a K
IC50
35±n/a nM
Comments
extracted
Citation
 Ortega Muñoz, AFyfe, MCMartinell Pedemonte, MEstiarte Martinez, MValls Vidal, NKurz, GCastro Palomino Laria, JC (Hetero)aryl cyclopropylamine compounds as LSD1 inhibitors US Patent  US9670136 Publication Date 6/6/2017 
Target
Name:
Lysine-specific histone demethylase 1A
Synonyms:
AOF2 Flavin-containing amine oxidase domain-containing protein 2 KDM1A KIAA0601 Lysine-specific demethylase 1 (LSD1) Lysine-specific histone demethylase 1 (LSD1)
Type:
Enzyme
Mol. Mass.:
92901.01
Organism:
Homo sapiens (Human)
Description:
O60341
Residue:
852
  
Inhibitor
Name:
BDBM254572
Synonyms:
US10214477, Example 31 US9670136, 31 N1-(2-(2-fluorophenyl)cyclopropyl)cyclohexane-1,4-diamine
Type:
Small organic molecule
Emp. Form.:
C15H21FN2
Mol. Mass.:
248.339
SMILES:
NC1CCC(CC1)NC1CC1c1ccccc1F
: