Target
Amine oxidase [flavin-containing] B
Ligand
BDBM254598
Substrate
Meas. Tech.
Monoamine Oxidase Assays
IC50
3240±n/a nM
Citation
 Ortega Muñoz, AFyfe, MCMartinell Pedemonte, MEstiarte Martinez, MValls Vidal, NKurz, GCastro Palomino Laria, JC (Hetero)aryl cyclopropylamine compounds as LSD1 inhibitors US Patent  US9670136 Publication Date 6/6/2017 
Target
Name:
Amine oxidase [flavin-containing] B
Synonyms:
AOFB_HUMAN MAOB Monoamine oxidase type B (MAO B) Monoamine oxidase type B (MAOB)
Type:
Protein
Mol. Mass.:
58768.76
Organism:
Homo sapiens (Human)
Description:
P27338
Residue:
520
  
Inhibitor
Name:
BDBM254598
Synonyms:
US10214477, Example 57 US9670136, 57 N1-((trans)-2-(4-((2-fluorobenzyl)oxy)phenyl)cyclopropyl)cyclohexane-1,4-diamine
Type:
Small organic molecule
Emp. Form.:
C22H27FN2O
Mol. Mass.:
354.461
SMILES:
NC1CCC(CC1)N[C@H]1C[C@@H]1c1ccc(OCc2ccccc2F)cc1
: