Target
Beta-glucuronidase
Ligand
BDBM316457
Substrate
Meas. Tech.
β-Glucuronidase Activity Assay
IC50
70.0±n/a nM
Citation
 Williams, ALScott, JYeh, LRedinbo, MR Phenoxy thiophene sulfonamides and their use as inhibitors of glucuronidase US Patent  US9617239 Publication Date 4/11/2017 
Target
Name:
Beta-glucuronidase
Synonyms:
β-Glucuronidase Beta-G1 GUSB | beta-Glucuronidase (β-glucuronidase)
Type:
Protein
Mol. Mass.:
74736.05
Organism:
Homo sapiens (Human)
Description:
Residue:
651
  
Inhibitor
Name:
BDBM316457
Synonyms:
US9617239, BRITE-492800
Type:
Small organic molecule
Emp. Form.:
C20H19Cl2N3O3S2
Mol. Mass.:
484.419
SMILES:
Clc1cc(sc1Oc1cccc(c1)N1CCNCC1)S(=O)(=O)Nc1cccc(Cl)c1
: