Target
Cytochrome P450 2D6
Ligand
BDBM317045
Substrate
Meas. Tech.
Inhibition Assay
IC50
>10000±n/a nM
Citation
 Ibrahim, PNSpevak, WCho, HShi, SZhang, CZhang, Y Compounds and methods for kinase modulation, and indications therefor US Patent  US9617267 Publication Date 4/11/2017 
Target
Name:
Cytochrome P450 2D6
Synonyms:
CP2D6_HUMAN CYP2DL1 Cytochrome P450 2D6 (CYP2D6) P450-DB1
Type:
Protein
Mol. Mass.:
55774.82
Organism:
Homo sapiens (Human)
Description:
P10635
Residue:
497
  
Inhibitor
Name:
BDBM317045
Synonyms:
N-{3-[4-(1-Ethyl-1H-pyrazol- 4-ylamino)-7H-pyrrolo[2,3- d]pyrimidine-5-carbonyl]- 2,4-difluoro-phenyl}-2,5- difluoro-benzenesulfonamide | US9617267, Compound P-1142
Type:
Small organic molecule
Emp. Form.:
C24H17F4N7O3S
Mol. Mass.:
559.495
SMILES:
CCn1cc(Nc2ncnc3[nH]cc(C(=O)c4c(F)ccc(NS(=O)(=O)c5cc(F)ccc5F)c4F)c23)cn1
: