Target
Carbonic anhydrase 1
Ligand
BDBM10874
Substrate
BDBM10856
Meas. Tech.
CA Inhibition Assay
Ki
95±n/a nM
Citation
 Nishimori, IMinakuchi, TMorimoto, KSano, SOnishi, STakeuchi, HVullo, DScozzafava, ASupuran, CT Carbonic anhydrase inhibitors: DNA cloning and inhibition studies of the alpha-carbonic anhydrase from Helicobacter pylori, a new target for developing sulfonamide and sulfamate gastric drugs. J Med Chem 49:2117-26 (2006)  
Target
Name:
Carbonic anhydrase 1
Synonyms:
CA-I CAB Carbonate dehydratase I Carbonic anhydrase 1 (CA I) Carbonic anhydrase 1 (Recombinant CA I) Carbonic anhydrase B Carbonic anhydrase I (CA I) Carbonic anhydrase I (CAI) Carbonic anhydrase isoenzyme I (hCA I) | hCA
Type:
Enzyme
Mol. Mass.:
28873.37
Organism:
Homo sapiens (Human)
Description:
P00915
Residue:
261
  
Inhibitor
Name:
BDBM10874
Synonyms:
6-hydroxy-1,3-benzothiazole-2-sulfonamide aromatic/heteroaromatic sulfonamide 19
Type:
Small organic molecule
Emp. Form.:
C7H6N2O3S2
Mol. Mass.:
230.264
SMILES:
NS(=O)(=O)c1nc2ccc(O)cc2s1
:
Substrate
Name:
BDBM10856
Synonyms:
Carbon Dioxide | methanedione
Type:
Small organic molecule
Emp. Form.:
CO2
Mol. Mass.:
44.0095
SMILES:
O=C=O
: