Target
Sigma non-opioid intracellular receptor 1
Ligand
BDBM317218
Substrate
Meas. Tech.
Binding Assay
Ki
168±n/a nM
Citation
 Alcalde-Pais, MDiaz Fernández, JLMesquida-Estevez, MPaloma-Romeu, L Imidazo[2,1-b]thiazole derivatives, their preparation and use as medicaments US Patent  US9617281 Publication Date 4/11/2017 
Target
Name:
Sigma non-opioid intracellular receptor 1
Synonyms:
OPRS1 SIGMAR1 Sigma non-opioid intracellular receptor 1 Sigma1-receptor Sterol isomerase-like protein
Type:
Protein
Mol. Mass.:
25307.17
Organism:
Cavia porcellus (Guinea pig)
Description:
Q60492
Residue:
223
  
Inhibitor
Name:
BDBM317218
Synonyms:
US9617281, Compound 4
Type:
Small organic molecule
Emp. Form.:
C19H24N4OS
Mol. Mass.:
356.485
SMILES:
C(CN1CCCCCC1)OCc1cn2nc(sc2n1)-c1ccccc1
: