Target
Sigma non-opioid intracellular receptor 1
Ligand
BDBM317231
Substrate
Meas. Tech.
Binding Assay
Ki
210±n/a nM
Citation
 Alcalde-Pais, MDiaz Fernández, JLMesquida-Estevez, MPaloma-Romeu, L Imidazo[2,1-b]thiazole derivatives, their preparation and use as medicaments US Patent  US9617281 Publication Date 4/11/2017 
Target
Name:
Sigma non-opioid intracellular receptor 1
Synonyms:
OPRS1 SIGMAR1 Sigma non-opioid intracellular receptor 1 Sigma1-receptor Sterol isomerase-like protein
Type:
Protein
Mol. Mass.:
25307.17
Organism:
Cavia porcellus (Guinea pig)
Description:
Q60492
Residue:
223
  
Inhibitor
Name:
BDBM317231
Synonyms:
2-(4-Fluorophenyl)- 6-((4- methylpiperazin-1- yl)methyl)imidazo[2, 1-b]thiazole maleate | US9617281, Compound 13
Type:
Small organic molecule
Emp. Form.:
C17H19FN4S
Mol. Mass.:
330.423
SMILES:
CN1CCN(Cc2cn3cc(sc3n2)-c2ccc(F)cc2)CC1
: