Target
Isocitrate dehydrogenase [NADP] cytoplasmic [1-390,401-414,R132C]
Ligand
BDBM317486
Substrate
IC50
550±n/a nM
Citation
 Lin, JEricsson, ACampbell, AGustafson, GWang, ZDiebold, RBAshwell, SLancia, Jr., DRCaravella, JALu, W Fused-bicyclic aryl quinolinone derivatives as mutant-isocitrate dehydrogenase inhibitors US Patent  US9624175 Publication Date 4/18/2017 
Target
Name:
Isocitrate dehydrogenase [NADP] cytoplasmic [1-390,401-414,R132C]
Synonyms:
IDH1 Isocitrate dehydrogenase [NADP] cytoplasmic (IDH1)(R132C) | PICD
Type:
Enzyme Catalytic Domain
Mol. Mass.:
45318.79
Organism:
Homo sapiens (Human)
Description:
O75874[1-390,401-414,R132C]
Residue:
404
  
Inhibitor
Name:
BDBM317486
Synonyms:
3-{[(1,3-benzoxazol-4-yl)amino]methyl}-6-chloro-1,2-dihydroquinolin-2-one | US9624175, Compound I-1
Type:
Small organic molecule
Emp. Form.:
C17H12ClN3O2
Mol. Mass.:
325.749
SMILES:
Clc1ccc2[nH]c(=O)c(CNc3cccc4ocnc34)cc2c1
: