Target
Isocitrate dehydrogenase [NADP] cytoplasmic [R132H]
Ligand
BDBM317506
Substrate
Meas. Tech.
Enzymatic Assay
IC50
>10000±n/a nM
Citation
 Lin, JEricsson, ACampbell, AGustafson, GWang, ZDiebold, RBAshwell, SLancia, Jr., DRCaravella, JALu, W Fused-bicyclic aryl quinolinone derivatives as mutant-isocitrate dehydrogenase inhibitors US Patent  US9624175 Publication Date 4/18/2017 
Target
Name:
Isocitrate dehydrogenase [NADP] cytoplasmic [R132H]
Synonyms:
Cytosolic NADP-isocitrate dehydrogenase (IDH1)(R132H) IDH1 R132H IDHC_HUMAN Isocitrate dehydrogenase 1 mutant (R132H) Isocitrate dehydrogenase [NADP] cytoplasmic (IDH1)(R132H) PICD
Type:
Protein
Mol. Mass.:
46641.74
Organism:
Homo sapiens (Human)
Description:
Human IDH1 R132H (SEQ ID No. 2 in patent). First three are removed. Google patent parsed wrong.
Residue:
414
  
Inhibitor
Name:
BDBM317506
Synonyms:
6-methoxy-3-{[(2-methyl-1,3-benzothiazol-5-yl)amino]methyl}-1,2-dihydroquinolin-2-one | US9624175, Compound I-21
Type:
Small organic molecule
Emp. Form.:
C19H17N3O2S
Mol. Mass.:
351.422
SMILES:
COc1ccc2[nH]c(=O)c(CNc3ccc4sc(C)nc4c3)cc2c1
: