Target
Isocitrate dehydrogenase [NADP] cytoplasmic [1-390,401-414,R132C]
Ligand
BDBM317539
Substrate
IC50
<100±n/a nM
Citation
 Lin, JEricsson, ACampbell, AGustafson, GWang, ZDiebold, RBAshwell, SLancia, Jr., DRCaravella, JALu, W Fused-bicyclic aryl quinolinone derivatives as mutant-isocitrate dehydrogenase inhibitors US Patent  US9624175 Publication Date 4/18/2017 
Target
Name:
Isocitrate dehydrogenase [NADP] cytoplasmic [1-390,401-414,R132C]
Synonyms:
IDH1 Isocitrate dehydrogenase [NADP] cytoplasmic (IDH1)(R132C) | PICD
Type:
Enzyme Catalytic Domain
Mol. Mass.:
45318.79
Organism:
Homo sapiens (Human)
Description:
O75874[1-390,401-414,R132C]
Residue:
404
  
Inhibitor
Name:
BDBM317539
Synonyms:
6-chloro-3-[(1S)-1-{[3-(2-methylpropyl)-2-oxo-2H,3H-[1,3]oxazolo[4,5-d]pyrimidin-5-yl]amino}ethyl]-1,2-dihydroquinolin-2-one | US9624175, Compound I-55
Type:
Small organic molecule
Emp. Form.:
C20H20ClN5O3
Mol. Mass.:
413.857
SMILES:
CC(C)Cn1c2nc(N[C@@H](C)c3cc4cc(Cl)ccc4[nH]c3=O)ncc2oc1=O
: