Target
Isocitrate dehydrogenase [NADP] cytoplasmic [1-390,401-414,R132C]
Ligand
BDBM317542
Substrate
IC50
5500±n/a nM
Citation
 Lin, JEricsson, ACampbell, AGustafson, GWang, ZDiebold, RBAshwell, SLancia, Jr., DRCaravella, JALu, W Fused-bicyclic aryl quinolinone derivatives as mutant-isocitrate dehydrogenase inhibitors US Patent  US9624175 Publication Date 4/18/2017 
Target
Name:
Isocitrate dehydrogenase [NADP] cytoplasmic [1-390,401-414,R132C]
Synonyms:
IDH1 Isocitrate dehydrogenase [NADP] cytoplasmic (IDH1)(R132C) | PICD
Type:
Enzyme Catalytic Domain
Mol. Mass.:
45318.79
Organism:
Homo sapiens (Human)
Description:
O75874[1-390,401-414,R132C]
Residue:
404
  
Inhibitor
Name:
BDBM317542
Synonyms:
6-chloro-3-[(1S)-1-[(9-methyl-8-oxo-8,9-dihydro-7H-purin-2-yl)amino]ethyl]-1,2-dihydroquinolin-2-one | US9624175, Compound I-58
Type:
Small organic molecule
Emp. Form.:
C17H15ClN6O2
Mol. Mass.:
370.793
SMILES:
C[C@H](Nc1ncc2[nH]c(=O)n(C)c2n1)c1cc2cc(Cl)ccc2[nH]c1=O
: