Target
Isocitrate dehydrogenase [NADP] cytoplasmic [1-390,401-414,R132C]
Ligand
BDBM317546
Substrate
IC50
5500±n/a nM
Citation
 Lin, JEricsson, ACampbell, AGustafson, GWang, ZDiebold, RBAshwell, SLancia, Jr., DRCaravella, JALu, W Fused-bicyclic aryl quinolinone derivatives as mutant-isocitrate dehydrogenase inhibitors US Patent  US9624175 Publication Date 4/18/2017 
Target
Name:
Isocitrate dehydrogenase [NADP] cytoplasmic [1-390,401-414,R132C]
Synonyms:
IDH1 Isocitrate dehydrogenase [NADP] cytoplasmic (IDH1)(R132C) | PICD
Type:
Enzyme Catalytic Domain
Mol. Mass.:
45318.79
Organism:
Homo sapiens (Human)
Description:
O75874[1-390,401-414,R132C]
Residue:
404
  
Inhibitor
Name:
BDBM317546
Synonyms:
6-chloro-3-[(1S)-1-({7-oxo-5H,6H,7H,8H-pyrido[2,3-d]pyrimidin-2-yl}amino)ethyl]-1,2-dihydroquinolin-2-one | US9624175, Compound I-62
Type:
Small organic molecule
Emp. Form.:
C18H16ClN5O2
Mol. Mass.:
369.805
SMILES:
C[C@H](Nc1ncc2CCC(=O)Nc2n1)c1cc2cc(Cl)ccc2[nH]c1=O
: