Target
Indoleamine 2,3-dioxygenase 1
Ligand
BDBM317547
Substrate
Meas. Tech.
Biological Activity Assay
IC50
205±n/a nM
Citation
 Balog, JAHuang, AChen, BChen, LShan, W IDO inhibitors US Patent  US9624188 Publication Date 4/18/2017 
Target
Name:
Indoleamine 2,3-dioxygenase 1
Synonyms:
I23O1_HUMAN IDO-1 INDO Indoleamine 2,3-dioxygenase | Indoleamine-pyrrole 2,3-dioxygenase
Type:
Enzyme
Mol. Mass.:
45330.80
Organism:
Homo sapiens (Human)
Description:
P14902
Residue:
403
  
Inhibitor
Name:
BDBM317547
Synonyms:
2-(3-(4-(diisobutylamino)-3-(3-(p-tolyl)ureido)phenyl)oxetan-3-yl)acetic acid | US9624188, 2
Type:
Small organic molecule
Emp. Form.:
C27H37N3O4
Mol. Mass.:
467.6004
SMILES:
CC(C)CN(CC(C)C)c1ccc(cc1NC(=O)Nc1ccc(C)cc1)C1(CC(O)=O)COC1
: