Target
Indoleamine 2,3-dioxygenase 1
Ligand
BDBM317549
Substrate
Meas. Tech.
Biological Activity Assay
IC50
0.700±n/a nM
Citation
 Balog, JAHuang, AChen, BChen, LShan, W IDO inhibitors US Patent  US9624188 Publication Date 4/18/2017 
Target
Name:
Indoleamine 2,3-dioxygenase 1
Synonyms:
I23O1_HUMAN IDO-1 INDO Indoleamine 2,3-dioxygenase | Indoleamine-pyrrole 2,3-dioxygenase
Type:
Enzyme
Mol. Mass.:
45330.80
Organism:
Homo sapiens (Human)
Description:
P14902
Residue:
403
  
Inhibitor
Name:
BDBM317549
Synonyms:
3-(3-(3-(2,4- difluorophenyl)ureido)-4- (diisobutylamino)phenyl)- 4,4,4-trifluorobutanoic acid | US9624188, 30
Type:
Small organic molecule
Emp. Form.:
C25H30F5N3O3
Mol. Mass.:
515.516
SMILES:
CC(C)CN(CC(C)C)c1ccc(cc1NC(=O)Nc1ccc(F)cc1F)C(CC(O)=O)C(F)(F)F
: