Target
Indoleamine 2,3-dioxygenase 1
Ligand
BDBM317552
Substrate
Meas. Tech.
Biological Activity Assay
IC50
169±n/a nM
Citation
 Balog, JAHuang, AChen, BChen, LShan, W IDO inhibitors US Patent  US9624188 Publication Date 4/18/2017 
Target
Name:
Indoleamine 2,3-dioxygenase 1
Synonyms:
I23O1_HUMAN IDO-1 INDO Indoleamine 2,3-dioxygenase | Indoleamine-pyrrole 2,3-dioxygenase
Type:
Enzyme
Mol. Mass.:
45330.80
Organism:
Homo sapiens (Human)
Description:
P14902
Residue:
403
  
Inhibitor
Name:
BDBM317552
Synonyms:
(s)-3-(4-(diisobutylamino)-3-(3-(2-methylpyrimidin-5-yl)ureido)phenyl)butanoic acid | US9624188, 39
Type:
Small organic molecule
Emp. Form.:
C24H35N5O3
Mol. Mass.:
441.5664
SMILES:
CC(C)CN(CC(C)C)c1ccc(cc1NC(=O)Nc1cnc(C)nc1)[C@@H](C)CC(O)=O
: