Target
Indoleamine 2,3-dioxygenase 1
Ligand
BDBM317557
Substrate
Meas. Tech.
Biological Activity Assay
IC50
7.00±n/a nM
Citation
 Balog, JAHuang, AChen, BChen, LShan, W IDO inhibitors US Patent  US9624188 Publication Date 4/18/2017 
Target
Name:
Indoleamine 2,3-dioxygenase 1
Synonyms:
I23O1_HUMAN IDO-1 INDO Indoleamine 2,3-dioxygenase | Indoleamine-pyrrole 2,3-dioxygenase
Type:
Enzyme
Mol. Mass.:
45330.80
Organism:
Homo sapiens (Human)
Description:
P14902
Residue:
403
  
Inhibitor
Name:
BDBM317557
Synonyms:
3-(4-(diisobutylamino)-3-(3-(3-(trifluoromethyl)isoxazol-5-yl)ureido)phenyl)butanoic acid | US9624188, 46
Type:
Small organic molecule
Emp. Form.:
C23H31F3N4O4
Mol. Mass.:
484.5118
SMILES:
CC(C)CN(CC(C)C)c1ccc(cc1NC(=O)Nc1cc(no1)C(F)(F)F)C(C)CC(O)=O
: