Target
Amine oxidase [flavin-containing] A
Ligand
BDBM10989
Substrate
BDBM10990
Meas. Tech.
MAO A and MAO B Activity Measurements
pH
7.5±n/a
Temperature
298.15±n/a K
Ki
9700±n/a nM
Citation
 Hubalek, FBinda, CLi, MHerzig, YSterling, JYoudim, MBMattevi, AEdmondson, DE Inactivation of purified human recombinant monoamine oxidases A and B by rasagiline and its analogues. J Med Chem 47:1760-6 (2004)  
Target
Name:
Amine oxidase [flavin-containing] A
Synonyms:
AOFA_HUMAN MAO-A Monoamine oxidase Monoamine oxidase type A (MAO A) Monoamine oxidase type A (MAOA)
Type:
Protein
Mol. Mass.:
59689.53
Organism:
Homo sapiens (Human)
Description:
P21397
Residue:
527
  
Inhibitor
Name:
BDBM10989
Synonyms:
(1R)-N-(prop-2-yn-1-yl)-2,3-dihydro-1H-inden-1-amine Rasagiline | US9034303, Rasagiline
Type:
Small organic molecule
Emp. Form.:
C12H13N
Mol. Mass.:
171.2383
SMILES:
C#CCN[C@@H]1CCc2ccccc12
:
Substrate
Name:
BDBM10990
Synonyms:
3-amino-1-(2-aminophenyl)propan-1-one Kynuramine
Type:
Small organic molecule
Emp. Form.:
C9H12N2O
Mol. Mass.:
164.2044
SMILES:
NCCC(=O)c1ccccc1N
: