Target
DNA-(apurinic or apyrimidinic site) endonuclease
Ligand
BDBM318452
Substrate
Meas. Tech.
Inhibition Assay
Ki
6700±n/a nM
Citation
 Gold, BIXie, XSrinivasan, AWang, L Compounds and methods for inhibition of AP endonuclease-1/redox factor-1 (HAPE1) activity US Patent  US9624235 Publication Date 4/18/2017 
Target
Name:
DNA-(apurinic or apyrimidinic site) endonuclease
Synonyms:
APE APEX APEX1_HUMAN Apurinic-apyrimidinic endonuclease 1 (APE-1) DNA-(apurinic or apyrimidinic site) lyase REF1
Type:
Protein
Mol. Mass.:
35560.12
Organism:
Homo sapiens (Human)
Description:
P27695
Residue:
318
  
Inhibitor
Name:
BDBM318452
Synonyms:
NSC131534 | US9624235, Compound 11
Type:
Small organic molecule
Emp. Form.:
C21H18N4O5
Mol. Mass.:
406.3914
SMILES:
COc1ccc(cc1)C(\Cc1ccccc1)=N/Nc1ccc(c(c1)[N+]([O-])=O)[N+]([O-])=O
: