Target
DNA-(apurinic or apyrimidinic site) endonuclease
Ligand
BDBM318444
Substrate
Meas. Tech.
Inhibition Assay
IC50
10100±n/a nM
Citation
 Gold, BIXie, XSrinivasan, AWang, L Compounds and methods for inhibition of AP endonuclease-1/redox factor-1 (HAPE1) activity US Patent  US9624235 Publication Date 4/18/2017 
Target
Name:
DNA-(apurinic or apyrimidinic site) endonuclease
Synonyms:
APE APEX APEX1_HUMAN Apurinic-apyrimidinic endonuclease 1 (APE-1) DNA-(apurinic or apyrimidinic site) lyase REF1
Type:
Protein
Mol. Mass.:
35560.12
Organism:
Homo sapiens (Human)
Description:
P27695
Residue:
318
  
Inhibitor
Name:
BDBM318444
Synonyms:
NSC332384 | US9624235, Compound 2
Type:
Small organic molecule
Emp. Form.:
C19H17N3O3
Mol. Mass.:
335.3566
SMILES:
COc1cccc(\C=N\Nc2cc(C)nc3cc4OCOc4cc23)c1
: