Target
Histone deacetylase 6
Ligand
BDBM188027
Substrate
Meas. Tech.
HDAC6 Assay
IC50
1100±n/a nM
Citation
 Hebach, CKallen, JNozulak, JTintelnot-Blomley, MWidler, L Trifluoromethyl-oxadiazole derivatives and their use in the treatment of disease US Patent  US9670193 Publication Date 6/6/2017 
Target
Name:
Histone deacetylase 6
Synonyms:
Cereblon/Histone deacetylase 6 HDAC6 Histone deacetylase 6 (HDAC6) KIAA0901 | ORF Names:JM21
Type:
Chromatin regulator; hydrolase; repressor
Mol. Mass.:
131381.51
Organism:
Homo sapiens (Human)
Description:
Q9UBN7
Residue:
1215
  
Inhibitor
Name:
BDBM188027
Synonyms:
US9670193, 43 N-(Pyridin-4-ylmethyl)-2-(5-(trifluoromethyl)-1,2,4-oxadiazol-3-yl)pyrimidin-5-amine (TFA salt)
Type:
Small organic molecule
Emp. Form.:
C13H9F3N6O
Mol. Mass.:
322.2454
SMILES:
FC(F)(F)c1nc(no1)-c1ncc(NCc2ccncc2)cn1
: