Target
Interleukin-1 receptor-associated kinase 4
Ligand
BDBM319550
Substrate
Meas. Tech.
IRAK4 Enzymatic DELFIA Assay, Protocol A
IC50
7.50±n/a nM
Citation
 Lee, KLAllais, CPDehnhardt, CMGavrin, LKHan, SHepworth, DLee, ALovering, FEMathias, JPOwen, DRPapaioannou, NSaiah, EStrohbach, JWTrzupek, JDWright, SWZapf, CW Bicyclic-fused heteroaryl or aryl compounds as IRAK4 modulators US Patent  US10174000 Publication Date 1/8/2019 
Target
Name:
Interleukin-1 receptor-associated kinase 4
Synonyms:
IRAK-4 IRAK4_HUMAN Interleukin-1 receptor-associated kinase 4 (IRAK4) | Renal carcinoma antigen NY-REN-64
Type:
Protein
Mol. Mass.:
51519.08
Organism:
Homo sapiens (Human)
Description:
Q9NWZ3
Residue:
460
  
Inhibitor
Name:
BDBM319550
Synonyms:
8-{[(2S,3S,4S)-3-Ethyl-4-fluoro-5-oxopyrrolidin-2-yl]methoxy}-2-methoxyquinoline-3-carboxamide | US10174000, Example 1
Type:
Small organic molecule
Emp. Form.:
C18H20FN3O4
Mol. Mass.:
361.3675
SMILES:
CC[C@H]1[C@@H](COc2cccc3cc(C(N)=O)c(OC)nc23)NC(=O)[C@H]1F
: