Target
Interleukin-1 receptor-associated kinase 4
Ligand
BDBM319554
Substrate
Meas. Tech.
IRAK4 Enzymatic DELFIA Assay, Protocol A
IC50
3.70±n/a nM
Citation
 Lee, KLAllais, CPDehnhardt, CMGavrin, LKHan, SHepworth, DLee, ALovering, FEMathias, JPOwen, DRPapaioannou, NSaiah, EStrohbach, JWTrzupek, JDWright, SWZapf, CW Bicyclic-fused heteroaryl or aryl compounds as IRAK4 modulators US Patent  US10174000 Publication Date 1/8/2019 
Target
Name:
Interleukin-1 receptor-associated kinase 4
Synonyms:
IRAK-4 IRAK4_HUMAN Interleukin-1 receptor-associated kinase 4 (IRAK4) | Renal carcinoma antigen NY-REN-64
Type:
Protein
Mol. Mass.:
51519.08
Organism:
Homo sapiens (Human)
Description:
Q9NWZ3
Residue:
460
  
Inhibitor
Name:
BDBM319554
Synonyms:
4-(1-methyl-1H-pyrazol-4-yl)-1-{[(2S)-5-oxopyrrolidin-2-yl]methoxy}-7-(propan-2-yloxy)isoquinoline-6-carboxamide | US10174000, Example 5
Type:
Small organic molecule
Emp. Form.:
C22H25N5O4
Mol. Mass.:
423.465
SMILES:
CC(C)Oc1cc2c(OC[C@@H]3CCC(=O)N3)ncc(-c3cnn(C)c3)c2cc1C(N)=O
: