Target
Interleukin-1 receptor-associated kinase 4
Ligand
BDBM319560
Substrate
Meas. Tech.
IRAK4 Enzymatic DELFIA Assay, Protocol B
IC50
1300±n/a nM
Citation
 Lee, KLAllais, CPDehnhardt, CMGavrin, LKHan, SHepworth, DLee, ALovering, FEMathias, JPOwen, DRPapaioannou, NSaiah, EStrohbach, JWTrzupek, JDWright, SWZapf, CW Bicyclic-fused heteroaryl or aryl compounds as IRAK4 modulators US Patent  US10174000 Publication Date 1/8/2019 
Target
Name:
Interleukin-1 receptor-associated kinase 4
Synonyms:
IRAK-4 IRAK4_HUMAN Interleukin-1 receptor-associated kinase 4 (IRAK4) | Renal carcinoma antigen NY-REN-64
Type:
Protein
Mol. Mass.:
51519.08
Organism:
Homo sapiens (Human)
Description:
Q9NWZ3
Residue:
460
  
Inhibitor
Name:
BDBM319560
Synonyms:
1-{[(2S,3R)-3-Ethyl-5-oxopyrrolidin-2-yl]methoxy}-7-(propan-2-yloxy)-4-[(pyridin-3-ylsulfonyl)amino]isoquinoline-6-carboxamide | US10174000, Example 11
Type:
Small organic molecule
Emp. Form.:
C25H29N5O6S
Mol. Mass.:
527.593
SMILES:
CC[C@@H]1CC(=O)N[C@@H]1COc1ncc(NS(=O)(=O)c2cccnc2)c2cc(C(N)=O)c(OC(C)C)cc12
: